{"text_format":"1","workbook":"xlsx","n_sheets":3,"sheets":["Instructions","Expected QB Values","QB Report"],"not_rendered":{"charts":0,"images":2,"macros":1,"external_links":0,"defined_names":3245,"comments":0,"pivot_tables":0},"unopened":[],"bounds":{"document_bytes":16777216,"sheet_cells":100000,"rows_first":2000,"rows_last":500,"rows_between":2000,"halvings":0,"cell_chars":16384,"cell_head_chars":4096},"cells_cut":0,"cells_raw":0,"read":"whole","date_system":"1900"}

{"sheet":"Instructions","index":0,"n_rows":9,"n_cols":1,"rows_kept":9,"cut":false,"hidden":false,"merged":[]}
["How to Use this Report:"]
["1. In AdvancePro, perform an export to QuickBooks."]
["2. Run \"Inventory Valuation Summary\" report in QB."]
["3. Export report to new Excel worksheet."]
["4. On the exported sheet, adjust columns as necessary so that Column C = 'Inventory', Column D = 'On Hand', Column F = 'Calculated Avg', and Column H = 'Asset Value'"]
["5. Select columns A to H, copy those columns and then paste onto the 'QB Report' sheet of this workbook (click on cell A1 and paste)"]
["6. Go to the 'Expected QB Values' sheet and set the start and end dates at the top to calculate avg. cost. Only bills & work orders within the selected date range will be used to calculate the avg. cost (if there are no bills or work orders, the current cost set for the  product will be used)."]
["7. Click the 'Refresh Report' button to populate the report with the latest AdvancePro data."]
["8. Save the report with a different name for reference (this will allow you to revert back if you accidentally refresh and affect the values used for comparison)."]

{"sheet":"Expected QB Values","index":1,"n_rows":123,"n_cols":24,"rows_kept":123,"cut":false,"hidden":false,"merged":[[3,1,3,5],[3,8,3,16],[3,17,3,23],[0,6,0,7],[3,6,3,7],[0,2,2,5]]}
[null,null,"AP vs. QB Inventory Comparison Report",null,null,null,"Avg. Cost Calculation"]
[null,null,null,null,null,null,"Start Date:","2018-01-01"]
[null,null,null,null,null,null,"End Date:","2018-12-31"]
[null,"AP Product Details",null,null,null,null,"QB Export Status",null,"Quantities on transactions pending export to QB (DS = 'Drop Ship', WO = 'Work Order')\nAdjusted = Inventory adjustments pending QB export (blank if auto adjust QB inv. Setting is enabled)",null,null,null,null,null,null,null,null,"Expected QB values vs. actual"]
["ID","Product SKU","Product Name","AP QTY","Cost","Avg. Cost","Exportable","Exported","Bills","DS Bills","Cust RMA","WO Built","Invoices","DS Invoices","Vendor RMA","WO Used","Adjusted","Exp. QB QTY","Actual QB QTY","Exp. Avg. Cost","Actual Avg. Cost","Exp. Asset Value","Actual Asset Value","Value Difference"]
[1290,"123","ASEMBLY 1",0,57.5,null,1,1,null,null,null,null,null,null,null,null,null,0,{"$f":"INDEX('QB Report'!D:D,MATCH(Table_Query_from_AdvancePro_DB4[[#This Row],[Product SKU]]&\"*\",'QB Report'!C:C,0))","v":{"$error":"#N/A"}},57.5,{"$f":"INDEX('QB Report'!F:F,MATCH(Table_Query_from_AdvancePro_DB4[[#This Row],[Product SKU]]&\"*\",'QB Report'!C:C,0))","v":{"$error":"#N/A"}},0,{"$f":"INDEX('QB Report'!H:H,MATCH(Table_Query_from_AdvancePro_DB4[[#This Row],[Product SKU]]&\"*\",'QB Report'!C:C,0))","v":{"$error":"#N/A"}},{"$f":"Table_Query_from_AdvancePro_DB4[[#This Row],[Actual Asset Value]]-Table_Query_from_AdvancePro_DB4[[#This Row],[Exp. Asset Value]]","v":{"$error":"#N/A"}}]
[1227,"252025-L3-W1-T4","CF25 with 25-26.9 Density, 32-35 long, <14 wide, 2.00-2.25 thick",40,13.4,13.4,1,1,null,null,null,null,null,null,null,null,null,40,{"$f":"INDEX('QB Report'!D:D,MATCH(Table_Query_from_AdvancePro_DB4[[#This Row],[Product SKU]]&\"*\",'QB Report'!C:C,0))","v":40},13.4,{"$f":"INDEX('QB Report'!F:F,MATCH(Table_Query_from_AdvancePro_DB4[[#This Row],[Product SKU]]&\"*\",'QB Report'!C:C,0))","v":3.4},536,{"$f":"INDEX('QB Report'!H:H,MATCH(Table_Query_from_AdvancePro_DB4[[#This Row],[Product SKU]]&\"*\",'QB Report'!C:C,0))","v":136},{"$f":"Table_Query_from_AdvancePro_DB4[[#This Row],[Actual Asset Value]]-Table_Query_from_AdvancePro_DB4[[#This Row],[Exp. Asset Value]]","v":-400}]
[1285,"2x20 ABC","2x20 ft ABC",0,2,null,1,1,null,null,null,null,null,null,null,null,null,0,{"$f":"INDEX('QB Report'!D:D,MATCH(Table_Query_from_AdvancePro_DB4[[#This Row],[Product SKU]]&\"*\",'QB Report'!C:C,0))","v":{"$error":"#N/A"}},2,{"$f":"INDEX('QB Report'!F:F,MATCH(Table_Query_from_AdvancePro_DB4[[#This Row],[Product SKU]]&\"*\",'QB Report'!C:C,0))","v":{"$error":"#N/A"}},0,{"$f":"INDEX('QB Report'!H:H,MATCH(Table_Query_from_AdvancePro_DB4[[#This Row],[Product SKU]]&\"*\",'QB Report'!C:C,0))","v":{"$error":"#N/A"}},{"$f":"Table_Query_from_AdvancePro_DB4[[#This Row],[Actual Asset Value]]-Table_Query_from_AdvancePro_DB4[[#This Row],[Exp. Asset Value]]","v":{"$error":"#N/A"}}]
[1225,"303030-L4-W2-T3","CF30 with 30+ Density, 36-39 logn, 14-15 wide, 1.75-1.99 thick",100,43.4,43.4,1,1,null,null,null,null,null,null,null,null,null,100,{"$f":"INDEX('QB Report'!D:D,MATCH(Table_Query_from_AdvancePro_DB4[[#This Row],[Product SKU]]&\"*\",'QB Report'!C:C,0))","v":100},43.4,{"$f":"INDEX('QB Report'!F:F,MATCH(Table_Query_from_AdvancePro_DB4[[#This Row],[Product SKU]]&\"*\",'QB Report'!C:C,0))","v":3.4},4340,{"$f":"INDEX('QB Report'!H:H,MATCH(Table_Query_from_AdvancePro_DB4[[#This Row],[Product SKU]]&\"*\",'QB Report'!C:C,0))","v":340},{"$f":"Table_Query_from_AdvancePro_DB4[[#This Row],[Actual Asset Value]]-Table_Query_from_AdvancePro_DB4[[#This Row],[Exp. Asset Value]]","v":-4000}]
[1270,"3M Angle","3M Angle",0,26,null,1,1,null,null,null,null,null,null,null,null,null,0,{"$f":"INDEX('QB Report'!D:D,MATCH(Table_Query_from_AdvancePro_DB4[[#This Row],[Product SKU]]&\"*\",'QB Report'!C:C,0))","v":{"$error":"#N/A"}},26,{"$f":"INDEX('QB Report'!F:F,MATCH(Table_Query_from_AdvancePro_DB4[[#This Row],[Product SKU]]&\"*\",'QB Report'!C:C,0))","v":{"$error":"#N/A"}},0,{"$f":"INDEX('QB Report'!H:H,MATCH(Table_Query_from_AdvancePro_DB4[[#This Row],[Product SKU]]&\"*\",'QB Report'!C:C,0))","v":{"$error":"#N/A"}},{"$f":"Table_Query_from_AdvancePro_DB4[[#This Row],[Actual Asset Value]]-Table_Query_from_AdvancePro_DB4[[#This Row],[Exp. Asset Value]]","v":{"$error":"#N/A"}}]
[1271,"3M Angle 2","3M Angle",0,26,null,1,1,null,null,null,null,null,null,null,null,null,0,{"$f":"INDEX('QB Report'!D:D,MATCH(Table_Query_from_AdvancePro_DB4[[#This Row],[Product SKU]]&\"*\",'QB Report'!C:C,0))","v":{"$error":"#N/A"}},26,{"$f":"INDEX('QB Report'!F:F,MATCH(Table_Query_from_AdvancePro_DB4[[#This Row],[Product SKU]]&\"*\",'QB Report'!C:C,0))","v":{"$error":"#N/A"}},0,{"$f":"INDEX('QB Report'!H:H,MATCH(Table_Query_from_AdvancePro_DB4[[#This Row],[Product SKU]]&\"*\",'QB Report'!C:C,0))","v":{"$error":"#N/A"}},{"$f":"Table_Query_from_AdvancePro_DB4[[#This Row],[Actual Asset Value]]-Table_Query_from_AdvancePro_DB4[[#This Row],[Exp. Asset Value]]","v":{"$error":"#N/A"}}]
[1284,"4x20 ABC ","4 ft x 20 ft roll ABC",400,2,null,1,1,5,null,null,null,null,null,null,null,null,395,{"$f":"INDEX('QB Report'!D:D,MATCH(Table_Query_from_AdvancePro_DB4[[#This Row],[Product SKU]]&\"*\",'QB Report'!C:C,0))","v":{"$error":"#N/A"}},2,{"$f":"INDEX('QB Report'!F:F,MATCH(Table_Query_from_AdvancePro_DB4[[#This Row],[Product SKU]]&\"*\",'QB Report'!C:C,0))","v":{"$error":"#N/A"}},790,{"$f":"INDEX('QB Report'!H:H,MATCH(Table_Query_from_AdvancePro_DB4[[#This Row],[Product SKU]]&\"*\",'QB Report'!C:C,0))","v":{"$error":"#N/A"}},{"$f":"Table_Query_from_AdvancePro_DB4[[#This Row],[Actual Asset Value]]-Table_Query_from_AdvancePro_DB4[[#This Row],[Exp. Asset Value]]","v":{"$error":"#N/A"}}]
[1223,"801000","AutoClave Green H10 ",10,47.4,24.771428571428572,1,1,null,null,null,null,null,null,null,null,null,10,{"$f":"INDEX('QB Report'!D:D,MATCH(Table_Query_from_AdvancePro_DB4[[#This Row],[Product SKU]]&\"*\",'QB Report'!C:C,0))","v":0},24.771428571428572,{"$f":"INDEX('QB Report'!F:F,MATCH(Table_Query_from_AdvancePro_DB4[[#This Row],[Product SKU]]&\"*\",'QB Report'!C:C,0))","v":3.4},247.71428571428572,{"$f":"INDEX('QB Report'!H:H,MATCH(Table_Query_from_AdvancePro_DB4[[#This Row],[Product SKU]]&\"*\",'QB Report'!C:C,0))","v":0},{"$f":"Table_Query_from_AdvancePro_DB4[[#This Row],[Actual Asset Value]]-Table_Query_from_AdvancePro_DB4[[#This Row],[Exp. Asset Value]]","v":-247.71428571428572}]
[1224,"803000","Calcined H10",25,13.4,34.006060606060608,1,1,null,null,null,null,null,null,null,null,null,25,{"$f":"INDEX('QB Report'!D:D,MATCH(Table_Query_from_AdvancePro_DB4[[#This Row],[Product SKU]]&\"*\",'QB Report'!C:C,0))","v":0},34.006060606060608,{"$f":"INDEX('QB Report'!F:F,MATCH(Table_Query_from_AdvancePro_DB4[[#This Row],[Product SKU]]&\"*\",'QB Report'!C:C,0))","v":3.4},850.15151515151524,{"$f":"INDEX('QB Report'!H:H,MATCH(Table_Query_from_AdvancePro_DB4[[#This Row],[Product SKU]]&\"*\",'QB Report'!C:C,0))","v":0},{"$f":"Table_Query_from_AdvancePro_DB4[[#This Row],[Actual Asset Value]]-Table_Query_from_AdvancePro_DB4[[#This Row],[Exp. Asset Value]]","v":-850.15151515151524}]
[1243,"ABM-04","Alabaster Black - Marble - 3/4 in - 110 x 54 inches",0,0,null,1,1,null,null,null,null,null,null,null,null,null,0,{"$f":"INDEX('QB Report'!D:D,MATCH(Table_Query_from_AdvancePro_DB4[[#This Row],[Product SKU]]&\"*\",'QB Report'!C:C,0))","v":0},0,{"$f":"INDEX('QB Report'!F:F,MATCH(Table_Query_from_AdvancePro_DB4[[#This Row],[Product SKU]]&\"*\",'QB Report'!C:C,0))","v":0},0,{"$f":"INDEX('QB Report'!H:H,MATCH(Table_Query_from_AdvancePro_DB4[[#This Row],[Product SKU]]&\"*\",'QB Report'!C:C,0))","v":0},{"$f":"Table_Query_from_AdvancePro_DB4[[#This Row],[Actual Asset Value]]-Table_Query_from_AdvancePro_DB4[[#This Row],[Exp. Asset Value]]","v":0}]
[1221,"ASSEM0002","Assembly Item 2",2,2,2,1,1,1,null,null,null,null,null,null,null,null,1,{"$f":"INDEX('QB Report'!D:D,MATCH(Table_Query_from_AdvancePro_DB4[[#This Row],[Product SKU]]&\"*\",'QB Report'!C:C,0))","v":0},2,{"$f":"INDEX('QB Report'!F:F,MATCH(Table_Query_from_AdvancePro_DB4[[#This Row],[Product SKU]]&\"*\",'QB Report'!C:C,0))","v":0},2,{"$f":"INDEX('QB Report'!H:H,MATCH(Table_Query_from_AdvancePro_DB4[[#This Row],[Product SKU]]&\"*\",'QB Report'!C:C,0))","v":0},{"$f":"Table_Query_from_AdvancePro_DB4[[#This Row],[Actual Asset Value]]-Table_Query_from_AdvancePro_DB4[[#This Row],[Exp. Asset Value]]","v":-2}]
[1219,"ASSEM001","Test Assembly",1,17,17,1,1,null,null,null,null,null,null,null,null,null,1,{"$f":"INDEX('QB Report'!D:D,MATCH(Table_Query_from_AdvancePro_DB4[[#This Row],[Product SKU]]&\"*\",'QB Report'!C:C,0))","v":0},17,{"$f":"INDEX('QB Report'!F:F,MATCH(Table_Query_from_AdvancePro_DB4[[#This Row],[Product SKU]]&\"*\",'QB Report'!C:C,0))","v":0},17,{"$f":"INDEX('QB Report'!H:H,MATCH(Table_Query_from_AdvancePro_DB4[[#This Row],[Product SKU]]&\"*\",'QB Report'!C:C,0))","v":0},{"$f":"Table_Query_from_AdvancePro_DB4[[#This Row],[Actual Asset Value]]-Table_Query_from_AdvancePro_DB4[[#This Row],[Exp. Asset Value]]","v":-17}]
[1093,"AWA51","Alienware Area 51 Computer",2010,167,34.349901896664484,1,1,201,null,null,null,16,null,10,null,null,1835,{"$f":"INDEX('QB Report'!D:D,MATCH(Table_Query_from_AdvancePro_DB4[[#This Row],[Product SKU]]&\"*\",'QB Report'!C:C,0))","v":1540},34.349901896664484,{"$f":"INDEX('QB Report'!F:F,MATCH(Table_Query_from_AdvancePro_DB4[[#This Row],[Product SKU]]&\"*\",'QB Report'!C:C,0))","v":34},63032.069980379325,{"$f":"INDEX('QB Report'!H:H,MATCH(Table_Query_from_AdvancePro_DB4[[#This Row],[Product SKU]]&\"*\",'QB Report'!C:C,0))","v":52360},{"$f":"Table_Query_from_AdvancePro_DB4[[#This Row],[Actual Asset Value]]-Table_Query_from_AdvancePro_DB4[[#This Row],[Exp. Asset Value]]","v":-10672.069980379325}]
[1170,"B-11","B 11",255,1.2345678,9.9009900990099015E-2,1,1,1006,null,null,null,3,null,null,null,null,-748,{"$f":"INDEX('QB Report'!D:D,MATCH(Table_Query_from_AdvancePro_DB4[[#This Row],[Product SKU]]&\"*\",'QB Report'!C:C,0))","v":100},9.9009900990099015E-2,{"$f":"INDEX('QB Report'!F:F,MATCH(Table_Query_from_AdvancePro_DB4[[#This Row],[Product SKU]]&\"*\",'QB Report'!C:C,0))","v":0},-74.059405940594061,{"$f":"INDEX('QB Report'!H:H,MATCH(Table_Query_from_AdvancePro_DB4[[#This Row],[Product SKU]]&\"*\",'QB Report'!C:C,0))","v":0},{"$f":"Table_Query_from_AdvancePro_DB4[[#This Row],[Actual Asset Value]]-Table_Query_from_AdvancePro_DB4[[#This Row],[Exp. Asset Value]]","v":74.059405940594061}]
[1275,"B-218/B-514 5 1/4'' Mdf Base 4608' per unit","B-218/B-514 5 1/4'' Mdf Base 4608' per unit",1000,0,null,1,0,null,null,null,null,null,null,null,null,null,1000,{"$f":"INDEX('QB Report'!D:D,MATCH(Table_Query_from_AdvancePro_DB4[[#This Row],[Product SKU]]&\"*\",'QB Report'!C:C,0))","v":{"$error":"#N/A"}},0,{"$f":"INDEX('QB Report'!F:F,MATCH(Table_Query_from_AdvancePro_DB4[[#This Row],[Product SKU]]&\"*\",'QB Report'!C:C,0))","v":{"$error":"#N/A"}},0,{"$f":"INDEX('QB Report'!H:H,MATCH(Table_Query_from_AdvancePro_DB4[[#This Row],[Product SKU]]&\"*\",'QB Report'!C:C,0))","v":{"$error":"#N/A"}},{"$f":"Table_Query_from_AdvancePro_DB4[[#This Row],[Actual Asset Value]]-Table_Query_from_AdvancePro_DB4[[#This Row],[Exp. Asset Value]]","v":{"$error":"#N/A"}}]
[1214,"B-487","Glass Bauble ",8,300,300,1,1,null,null,null,null,null,null,null,null,null,8,{"$f":"INDEX('QB Report'!D:D,MATCH(Table_Query_from_AdvancePro_DB4[[#This Row],[Product SKU]]&\"*\",'QB Report'!C:C,0))","v":8},300,{"$f":"INDEX('QB Report'!F:F,MATCH(Table_Query_from_AdvancePro_DB4[[#This Row],[Product SKU]]&\"*\",'QB Report'!C:C,0))","v":300},2400,{"$f":"INDEX('QB Report'!H:H,MATCH(Table_Query_from_AdvancePro_DB4[[#This Row],[Product SKU]]&\"*\",'QB Report'!C:C,0))","v":2400},{"$f":"Table_Query_from_AdvancePro_DB4[[#This Row],[Actual Asset Value]]-Table_Query_from_AdvancePro_DB4[[#This Row],[Exp. Asset Value]]","v":0}]
[1215,"B-678","Baseball Card ",0,50,null,1,1,null,null,null,null,null,null,null,null,null,0,{"$f":"INDEX('QB Report'!D:D,MATCH(Table_Query_from_AdvancePro_DB4[[#This Row],[Product SKU]]&\"*\",'QB Report'!C:C,0))","v":0},50,{"$f":"INDEX('QB Report'!F:F,MATCH(Table_Query_from_AdvancePro_DB4[[#This Row],[Product SKU]]&\"*\",'QB Report'!C:C,0))","v":0},0,{"$f":"INDEX('QB Report'!H:H,MATCH(Table_Query_from_AdvancePro_DB4[[#This Row],[Product SKU]]&\"*\",'QB Report'!C:C,0))","v":0},{"$f":"Table_Query_from_AdvancePro_DB4[[#This Row],[Actual Asset Value]]-Table_Query_from_AdvancePro_DB4[[#This Row],[Exp. Asset Value]]","v":0}]
[1129,"B-9.50","9.50 Burner",100,167,null,1,1,null,null,null,null,null,null,null,null,null,100,{"$f":"INDEX('QB Report'!D:D,MATCH(Table_Query_from_AdvancePro_DB4[[#This Row],[Product SKU]]&\"*\",'QB Report'!C:C,0))","v":100},167,{"$f":"INDEX('QB Report'!F:F,MATCH(Table_Query_from_AdvancePro_DB4[[#This Row],[Product SKU]]&\"*\",'QB Report'!C:C,0))","v":34},16700,{"$f":"INDEX('QB Report'!H:H,MATCH(Table_Query_from_AdvancePro_DB4[[#This Row],[Product SKU]]&\"*\",'QB Report'!C:C,0))","v":3400},{"$f":"Table_Query_from_AdvancePro_DB4[[#This Row],[Actual Asset Value]]-Table_Query_from_AdvancePro_DB4[[#This Row],[Exp. Asset Value]]","v":-13300}]
[1251,"BASIC-ASSEMBLY","Basic Assembly",202,0,6.5,1,1,null,null,null,null,null,null,null,null,null,202,{"$f":"INDEX('QB Report'!D:D,MATCH(Table_Query_from_AdvancePro_DB4[[#This Row],[Product SKU]]&\"*\",'QB Report'!C:C,0))","v":{"$error":"#N/A"}},6.5,{"$f":"INDEX('QB Report'!F:F,MATCH(Table_Query_from_AdvancePro_DB4[[#This Row],[Product SKU]]&\"*\",'QB Report'!C:C,0))","v":{"$error":"#N/A"}},1313,{"$f":"INDEX('QB Report'!H:H,MATCH(Table_Query_from_AdvancePro_DB4[[#This Row],[Product SKU]]&\"*\",'QB Report'!C:C,0))","v":{"$error":"#N/A"}},{"$f":"Table_Query_from_AdvancePro_DB4[[#This Row],[Actual Asset Value]]-Table_Query_from_AdvancePro_DB4[[#This Row],[Exp. Asset Value]]","v":{"$error":"#N/A"}}]
[1207,"BASSWOOD","BASSWOOD",250,0,null,1,1,null,null,null,null,1,null,null,null,null,251,{"$f":"INDEX('QB Report'!D:D,MATCH(Table_Query_from_AdvancePro_DB4[[#This Row],[Product SKU]]&\"*\",'QB Report'!C:C,0))","v":100},0,{"$f":"INDEX('QB Report'!F:F,MATCH(Table_Query_from_AdvancePro_DB4[[#This Row],[Product SKU]]&\"*\",'QB Report'!C:C,0))","v":0},0,{"$f":"INDEX('QB Report'!H:H,MATCH(Table_Query_from_AdvancePro_DB4[[#This Row],[Product SKU]]&\"*\",'QB Report'!C:C,0))","v":0},{"$f":"Table_Query_from_AdvancePro_DB4[[#This Row],[Actual Asset Value]]-Table_Query_from_AdvancePro_DB4[[#This Row],[Exp. Asset Value]]","v":0}]
[1242,"BBG-01","Baltic Brown - Granite - 3/4in - 73 x 118 inches",51,0,0,1,1,null,null,null,null,1,null,null,null,null,52,{"$f":"INDEX('QB Report'!D:D,MATCH(Table_Query_from_AdvancePro_DB4[[#This Row],[Product SKU]]&\"*\",'QB Report'!C:C,0))","v":51},0,{"$f":"INDEX('QB Report'!F:F,MATCH(Table_Query_from_AdvancePro_DB4[[#This Row],[Product SKU]]&\"*\",'QB Report'!C:C,0))","v":0},0,{"$f":"INDEX('QB Report'!H:H,MATCH(Table_Query_from_AdvancePro_DB4[[#This Row],[Product SKU]]&\"*\",'QB Report'!C:C,0))","v":0},{"$f":"Table_Query_from_AdvancePro_DB4[[#This Row],[Actual Asset Value]]-Table_Query_from_AdvancePro_DB4[[#This Row],[Exp. Asset Value]]","v":0}]
[1066,"BCPotatoes","Betty Crocker Au Gratin Potatoes",79.099999999999994,7,null,1,1,null,null,null,null,17,null,null,null,null,96.1,{"$f":"INDEX('QB Report'!D:D,MATCH(Table_Query_from_AdvancePro_DB4[[#This Row],[Product SKU]]&\"*\",'QB Report'!C:C,0))","v":148},7,{"$f":"INDEX('QB Report'!F:F,MATCH(Table_Query_from_AdvancePro_DB4[[#This Row],[Product SKU]]&\"*\",'QB Report'!C:C,0))","v":7},672.69999999999993,{"$f":"INDEX('QB Report'!H:H,MATCH(Table_Query_from_AdvancePro_DB4[[#This Row],[Product SKU]]&\"*\",'QB Report'!C:C,0))","v":1036},{"$f":"Table_Query_from_AdvancePro_DB4[[#This Row],[Actual Asset Value]]-Table_Query_from_AdvancePro_DB4[[#This Row],[Exp. Asset Value]]","v":363.30000000000007}]
[1067,"BD001","BLACK & DECKER 20-Volt Max 3/8-in Cordless Battery Included Drill",17,1,1,1,1,1,7,null,null,null,null,null,null,null,9,{"$f":"INDEX('QB Report'!D:D,MATCH(Table_Query_from_AdvancePro_DB4[[#This Row],[Product SKU]]&\"*\",'QB Report'!C:C,0))","v":31.0001},1,{"$f":"INDEX('QB Report'!F:F,MATCH(Table_Query_from_AdvancePro_DB4[[#This Row],[Product SKU]]&\"*\",'QB Report'!C:C,0))","v":1},9,{"$f":"INDEX('QB Report'!H:H,MATCH(Table_Query_from_AdvancePro_DB4[[#This Row],[Product SKU]]&\"*\",'QB Report'!C:C,0))","v":31},{"$f":"Table_Query_from_AdvancePro_DB4[[#This Row],[Actual Asset Value]]-Table_Query_from_AdvancePro_DB4[[#This Row],[Exp. Asset Value]]","v":22}]
[1277,"BOB","BOB SAMPLE",10,1,null,1,1,10,null,null,null,null,null,null,null,null,0,{"$f":"INDEX('QB Report'!D:D,MATCH(Table_Query_from_AdvancePro_DB4[[#This Row],[Product SKU]]&\"*\",'QB Report'!C:C,0))","v":100},1,{"$f":"INDEX('QB Report'!F:F,MATCH(Table_Query_from_AdvancePro_DB4[[#This Row],[Product SKU]]&\"*\",'QB Report'!C:C,0))","v":0.01},0,{"$f":"INDEX('QB Report'!H:H,MATCH(Table_Query_from_AdvancePro_DB4[[#This Row],[Product SKU]]&\"*\",'QB Report'!C:C,0))","v":1},{"$f":"Table_Query_from_AdvancePro_DB4[[#This Row],[Actual Asset Value]]-Table_Query_from_AdvancePro_DB4[[#This Row],[Exp. Asset Value]]","v":1}]
[1279,"BOB2","BOBSAMPLE-2",99,10,null,1,1,null,null,null,null,1,null,null,null,null,100,{"$f":"INDEX('QB Report'!D:D,MATCH(Table_Query_from_AdvancePro_DB4[[#This Row],[Product SKU]]&\"*\",'QB Report'!C:C,0))","v":{"$error":"#N/A"}},10,{"$f":"INDEX('QB Report'!F:F,MATCH(Table_Query_from_AdvancePro_DB4[[#This Row],[Product SKU]]&\"*\",'QB Report'!C:C,0))","v":{"$error":"#N/A"}},1000,{"$f":"INDEX('QB Report'!H:H,MATCH(Table_Query_from_AdvancePro_DB4[[#This Row],[Product SKU]]&\"*\",'QB Report'!C:C,0))","v":{"$error":"#N/A"}},{"$f":"Table_Query_from_AdvancePro_DB4[[#This Row],[Actual Asset Value]]-Table_Query_from_AdvancePro_DB4[[#This Row],[Exp. Asset Value]]","v":{"$error":"#N/A"}}]
{"$rows_left_out":94}
{"sheet":"QB Report","index":2,"n_rows":96,"n_cols":8,"rows_kept":96,"cut":false,"hidden":false,"merged":[]}
[null,null,null,"On Hand",null,"Avg Cost",null,"Asset Value"]
[null,"Inventory"]
[null,null,"_-*@test (Test Product 1)",0,null,0,null,0]
[null,null,"ABM-04 (Alabaster Black - Marble - 3/4 in - 110 x 54 inches)",0,null,0,null,0]
[null,null,"B-11 (B 11)",100,null,0,null,0]
[null,null,"B-487 (Glass Bauble)",8,null,300,null,2400]
[null,null,"B-678 (Baseball Card)",0,null,0,null,0]
[null,null,"BASSWOOD (BASSWOOD)",100,null,0,null,0]
[null,null,"BBG-01 (Baltic Brown - Granite - 3/4in - 73 x 118 inches)",51,null,0,null,0]
[null,null,"BCPotatoes (Betty Crocker Au Gratin Potatoes)",148,null,7,null,1036]
[null,null,"BD001 (BLACK & DECKER 20-Volt Max 3/8-in Cordless Battery Included Drill)",31.0001,null,1,null,31]
[null,null,"BOB-BRIDGE (BOB-BRIDGE)",100,null,0.01,null,1]
[null,null,"BREAKER (BREAKER)",1,null,0,null,0]
[null,null,"BSODA (Arm & Hammer Baking Soda)",590.00004999999999,null,2,null,1180]
[null,null,"CEOSRT3 (CANNON EOS Rebel T3)",105,null,100,null,10500]
[null,null,"CN5012 (Canon 50mm 1.2L Lens)",100,null,1100,null,110000]
[null,null,"CN600EX (Canon Speedlite 600EX-RT Flash)",14,null,300,null,4200]
[null,null,"CO296 (Black Antique - Granite - 3/4 in - 112 x 71 inches)",1,null,0,null,0]
[null,null,"CT044 (Bianco Pentelico - Marble - 3/4 in - 116 x 76 inches)",1,null,0,null,0]
[null,null,"CVR-DYN-B (DYNA COVER TALL)",100,null,1,null,100]
[null,null,"CVR-DYN-B-GLD (PLATING FOR TALL DYNA - GOLD)",100,null,5,null,500]
[null,null,"CVR-DYN-CHM (PLATING FOR DYNA SHORT - CHROME)",99,null,3,null,297]
[null,null,"CVR-DYN-N (DYNA COVER SHORT)",100,null,5,null,500]
[null,null,"DREM001 (Dremel Micro 18-Piece Variable-Speed Multipurpose Rotary Tool Kit)",98,null,150,null,14700]
[null,null,"DREM002 (Dremel All-Purpose Rotary Tool Accessory Kit)",100,null,200,null,20000]
[null,null,"DW0002 (DEWALT 18-Volt 1/2-in Cordless Battery Included Drill with Soft Case)",200,null,1,null,200]
[null,null,"H10 (Hi Volatility Coal)",29720,null,1.7,null,50524]
[null,null,"HDGT01 (Hagen-Dazs Green Tea Ice Cream)",152,null,2,null,304]
[null,null,"IGL-03 (Indus Gold - Limestone - 3/4 in - 100 x 54 inches)",51,null,0,null,0]
[null,null,"INT001 (Intel Pentium G3240 Dual-Core 3.1GHz CPU/Gigabyte GA-B85M-HD3 mATX MB/4GB...",997,null,100,null,99700]
{"$rows_left_out":66}